### RED-PROOF R-868a: SendUnsent sends nothing (sendUnsentLocked returns 0 at once)
    unsent_test.go:31: sent 0, want 1
--- FAIL: TestR868_KilledPassIsReportedAtStart (0.00s)
--- PASS: TestR868_NormalPassLeavesNoCopyAndNoDuplicate (0.00s)
    unsent_test.go:91: sent 0: []
--- FAIL: TestR868_HubAwayKeepsTheCopy (0.00s)
    unsent_test.go:111: not sent after the pass: 0
--- FAIL: TestR868_RunningPassKeepsTheSenderOff (0.00s)
FAIL
FAIL	gitea.dooplex.hu/admin/felhom-agent/internal/osupdate	0.014s
FAIL
rc=1
### RED-PROOF R-868b: finish no longer deletes the sent copy
    unsent_test.go:31: sent 0, want 1
--- FAIL: TestR868_KilledPassIsReportedAtStart (0.00s)
    unsent_test.go:59: kept copies left after the hub got them: [/tmp/TestR868_NormalPassLeavesNoCopyAndNoDuplicate3889087443/001/report-20261004T040000Z-docker-apply.json /tmp/TestR868_NormalPassLeavesNoCopyAndNoDuplicate3889087443/001/report-20261004T040000Z-guest-apply.json /tmp/TestR868_NormalPassLeavesNoCopyAndNoDuplicate3889087443/001/report-20261004T040000Z-host-apply.json]
--- FAIL: TestR868_NormalPassLeavesNoCopyAndNoDuplicate (0.00s)
    unsent_test.go:91: sent 0: [{RunID:20261004T040000Z Layer:docker Trigger:night Mode:apply Ring:0 ReleaseID: Outcome:nothing Healthy:true HealthReason:sent after the agent stopped mid-pass (R-868) VMID:0 Upgraded:[] Installed:[] Pending:[] NotCovered:[] RestartNeeded:[] DockerRestartNeeded:false RebootNeeded:false RebootScanned:false Refused:[] PassSeconds:0 DockerEngine: Authority: Undo:false unsent:} {RunID:20261004T040000Z Layer:guest Trigger:night Mode:apply Ring:0 ReleaseID: Outcome:applied Healthy:true HealthReason:sent after the agent stopped mid-pass (R-868) VMID:0 Upgraded:[{Name:libc6 Version:u4 Origin:}] Installed:[] Pending:[] NotCovered:[] RestartNeeded:[] DockerRestartNeeded:false RebootNeeded:false RebootScanned:false Refused:[] PassSeconds:0 DockerEngine: Authority: Undo:false unsent:}]
--- FAIL: TestR868_HubAwayKeepsTheCopy (0.00s)
    unsent_test.go:111: not sent after the pass: 0
--- FAIL: TestR868_RunningPassKeepsTheSenderOff (0.00s)
FAIL
FAIL	gitea.dooplex.hu/admin/felhom-agent/internal/osupdate	0.012s
FAIL
rc=1
### RED-PROOF R-868c (wrapper): main() no longer saves the copy
ERROR: test_a_refusal_is_kept_too (test_felhom_os_apply.UnsentReport.test_a_refusal_is_kept_too)
FAIL: test_apply_keeps_a_copy_with_the_agents_ids (test_felhom_os_apply.UnsentReport.test_apply_keeps_a_copy_with_the_agents_ids)
Ran 86 tests in 0.520s
FAILED (failures=1, errors=1)
### restored
ok  	gitea.dooplex.hu/admin/felhom-agent/internal/osupdate	2.328s
OK
