F.FFFFFFFFF.F.FFF
======================================================================
FAIL: test_allow_listed_new_package_is_accepted (configs.test_felhom_os_apply.PVELane.test_allow_listed_new_package_is_accepted)
----------------------------------------------------------------------
Traceback (most recent call last):
  File "/mnt/5_hdd/felhom.eu/wt/pb/felhom-agent/configs/test_felhom_os_apply.py", line 1437, in test_allow_listed_new_package_is_accepted
    self.assertEqual(rc, 0, rep)
    ~~~~~~~~~~~~~~~~^^^^^^^^^^^^
AssertionError: 2 != 0 : {'mode': None, 'pass_seconds': 0.0, 'refused': {'code': 'R12', 'reason': "layer 'pve' is not guest, host or docker"}}

======================================================================
FAIL: test_debian_origin_in_the_pve_simulation_is_refused (configs.test_felhom_os_apply.PVELane.test_debian_origin_in_the_pve_simulation_is_refused)
----------------------------------------------------------------------
Traceback (most recent call last):
  File "/mnt/5_hdd/felhom.eu/wt/pb/felhom-agent/configs/test_felhom_os_apply.py", line 1405, in test_debian_origin_in_the_pve_simulation_is_refused
    self.refused(f, "R2")
    ~~~~~~~~~~~~^^^^^^^^^
  File "/mnt/5_hdd/felhom.eu/wt/pb/felhom-agent/configs/test_felhom_os_apply.py", line 1357, in refused
    self.assertEqual(rep["refused"]["code"], code, rep)
    ~~~~~~~~~~~~~~~~^^^^^^^^^^^^^^^^^^^^^^^^^^^^^^^^^^^
AssertionError: 'R12' != 'R2'
- R12
?  -
+ R2
 : {'mode': None, 'pass_seconds': 0.0, 'refused': {'code': 'R12', 'reason': "layer 'pve' is not guest, host or docker"}}

======================================================================
FAIL: test_debian_package_in_a_pve_plan_is_refused (configs.test_felhom_os_apply.PVELane.test_debian_package_in_a_pve_plan_is_refused)
----------------------------------------------------------------------
Traceback (most recent call last):
  File "/mnt/5_hdd/felhom.eu/wt/pb/felhom-agent/configs/test_felhom_os_apply.py", line 1400, in test_debian_package_in_a_pve_plan_is_refused
    self.refused(f, "R2")
    ~~~~~~~~~~~~^^^^^^^^^
  File "/mnt/5_hdd/felhom.eu/wt/pb/felhom-agent/configs/test_felhom_os_apply.py", line 1357, in refused
    self.assertEqual(rep["refused"]["code"], code, rep)
    ~~~~~~~~~~~~~~~~^^^^^^^^^^^^^^^^^^^^^^^^^^^^^^^^^^^
AssertionError: 'R12' != 'R2'
- R12
?  -
+ R2
 : {'mode': None, 'pass_seconds': 0.0, 'refused': {'code': 'R12', 'reason': "layer 'pve' is not guest, host or docker"}}

======================================================================
FAIL: test_docker_package_in_a_pve_plan_is_refused (configs.test_felhom_os_apply.PVELane.test_docker_package_in_a_pve_plan_is_refused)
----------------------------------------------------------------------
Traceback (most recent call last):
  File "/mnt/5_hdd/felhom.eu/wt/pb/felhom-agent/configs/test_felhom_os_apply.py", line 1410, in test_docker_package_in_a_pve_plan_is_refused
    self.refused(f, "R2")
    ~~~~~~~~~~~~^^^^^^^^^
  File "/mnt/5_hdd/felhom.eu/wt/pb/felhom-agent/configs/test_felhom_os_apply.py", line 1357, in refused
    self.assertEqual(rep["refused"]["code"], code, rep)
    ~~~~~~~~~~~~~~~~^^^^^^^^^^^^^^^^^^^^^^^^^^^^^^^^^^^
AssertionError: 'R12' != 'R2'
- R12
?  -
+ R2
 : {'mode': None, 'pass_seconds': 0.0, 'refused': {'code': 'R12', 'reason': "layer 'pve' is not guest, host or docker"}}

======================================================================
FAIL: test_docker_signed_op_does_not_authorize_a_pve_step (configs.test_felhom_os_apply.PVELane.test_docker_signed_op_does_not_authorize_a_pve_step)
----------------------------------------------------------------------
Traceback (most recent call last):
  File "/mnt/5_hdd/felhom.eu/wt/pb/felhom-agent/configs/test_felhom_os_apply.py", line 1421, in test_docker_signed_op_does_not_authorize_a_pve_step
    self.refused(pve_fake(signed=signed_job(packages=PVE_SET, op="os_docker_step")), "R3")
    ~~~~~~~~~~~~^^^^^^^^^^^^^^^^^^^^^^^^^^^^^^^^^^^^^^^^^^^^^^^^^^^^^^^^^^^^^^^^^^^^^^^^^^
  File "/mnt/5_hdd/felhom.eu/wt/pb/felhom-agent/configs/test_felhom_os_apply.py", line 1357, in refused
    self.assertEqual(rep["refused"]["code"], code, rep)
    ~~~~~~~~~~~~~~~~^^^^^^^^^^^^^^^^^^^^^^^^^^^^^^^^^^^
AssertionError: 'R12' != 'R3'
- R12
+ R3
 : {'mode': None, 'pass_seconds': 0.0, 'refused': {'code': 'R12', 'reason': "layer 'pve' is not guest, host or docker"}}

======================================================================
FAIL: test_kernel_in_a_pve_plan_is_refused (configs.test_felhom_os_apply.PVELane.test_kernel_in_a_pve_plan_is_refused)
----------------------------------------------------------------------
Traceback (most recent call last):
  File "/mnt/5_hdd/felhom.eu/wt/pb/felhom-agent/configs/test_felhom_os_apply.py", line 1378, in test_kernel_in_a_pve_plan_is_refused
    self.refused(f, "R14")
    ~~~~~~~~~~~~^^^^^^^^^^
  File "/mnt/5_hdd/felhom.eu/wt/pb/felhom-agent/configs/test_felhom_os_apply.py", line 1357, in refused
    self.assertEqual(rep["refused"]["code"], code, rep)
    ~~~~~~~~~~~~~~~~^^^^^^^^^^^^^^^^^^^^^^^^^^^^^^^^^^^
AssertionError: 'R12' != 'R14'
- R12
?   ^
+ R14
?   ^
 : {'mode': None, 'pass_seconds': 0.0, 'refused': {'code': 'R12', 'reason': "layer 'pve' is not guest, host or docker"}}

======================================================================
FAIL: test_kernel_pulled_in_by_the_simulation_is_refused (configs.test_felhom_os_apply.PVELane.test_kernel_pulled_in_by_the_simulation_is_refused)
----------------------------------------------------------------------
Traceback (most recent call last):
  File "/mnt/5_hdd/felhom.eu/wt/pb/felhom-agent/configs/test_felhom_os_apply.py", line 1389, in test_kernel_pulled_in_by_the_simulation_is_refused
    self.refused(f, "R6")  # not in the plan — refused before the name check; R14 below when it IS in the plan
    ~~~~~~~~~~~~^^^^^^^^^
  File "/mnt/5_hdd/felhom.eu/wt/pb/felhom-agent/configs/test_felhom_os_apply.py", line 1357, in refused
    self.assertEqual(rep["refused"]["code"], code, rep)
    ~~~~~~~~~~~~~~~~^^^^^^^^^^^^^^^^^^^^^^^^^^^^^^^^^^^
AssertionError: 'R12' != 'R6'
- R12
+ R6
 : {'mode': None, 'pass_seconds': 0.0, 'refused': {'code': 'R12', 'reason': "layer 'pve' is not guest, host or docker"}}

======================================================================
FAIL: test_no_authority_is_refused (configs.test_felhom_os_apply.PVELane.test_no_authority_is_refused)
----------------------------------------------------------------------
Traceback (most recent call last):
  File "/mnt/5_hdd/felhom.eu/wt/pb/felhom-agent/configs/test_felhom_os_apply.py", line 1418, in test_no_authority_is_refused
    self.refused(pve_fake(), "R3")
    ~~~~~~~~~~~~^^^^^^^^^^^^^^^^^^
  File "/mnt/5_hdd/felhom.eu/wt/pb/felhom-agent/configs/test_felhom_os_apply.py", line 1357, in refused
    self.assertEqual(rep["refused"]["code"], code, rep)
    ~~~~~~~~~~~~~~~~^^^^^^^^^^^^^^^^^^^^^^^^^^^^^^^^^^^
AssertionError: 'R12' != 'R3'
- R12
+ R3
 : {'mode': None, 'pass_seconds': 0.0, 'refused': {'code': 'R12', 'reason': "layer 'pve' is not guest, host or docker"}}

======================================================================
FAIL: test_pve_in_the_fast_lane_is_refused (configs.test_felhom_os_apply.PVELane.test_pve_in_the_fast_lane_is_refused)
----------------------------------------------------------------------
Traceback (most recent call last):
  File "/mnt/5_hdd/felhom.eu/wt/pb/felhom-agent/configs/test_felhom_os_apply.py", line 1415, in test_pve_in_the_fast_lane_is_refused
    self.refused(f, "R3")
    ~~~~~~~~~~~~^^^^^^^^^
  File "/mnt/5_hdd/felhom.eu/wt/pb/felhom-agent/configs/test_felhom_os_apply.py", line 1357, in refused
    self.assertEqual(rep["refused"]["code"], code, rep)
    ~~~~~~~~~~~~~~~~^^^^^^^^^^^^^^^^^^^^^^^^^^^^^^^^^^^
AssertionError: 'R12' != 'R3'
- R12
+ R3
 : {'mode': None, 'pass_seconds': 0.0, 'refused': {'code': 'R12', 'reason': "layer 'pve' is not guest, host or docker"}}

======================================================================
FAIL: test_pve_manager_plan_is_installed_on_the_host (configs.test_felhom_os_apply.PVELane.test_pve_manager_plan_is_installed_on_the_host)
----------------------------------------------------------------------
Traceback (most recent call last):
  File "/mnt/5_hdd/felhom.eu/wt/pb/felhom-agent/configs/test_felhom_os_apply.py", line 1365, in test_pve_manager_plan_is_installed_on_the_host
    self.assertEqual(rc, 0, rep)
    ~~~~~~~~~~~~~~~~^^^^^^^^^^^^
AssertionError: 2 != 0 : {'mode': None, 'pass_seconds': 0.0, 'refused': {'code': 'R12', 'reason': "layer 'pve' is not guest, host or docker"}}

======================================================================
FAIL: test_ring0_pending_pve_takes_only_installed_proxmox_userspace (configs.test_felhom_os_apply.PVELane.test_ring0_pending_pve_takes_only_installed_proxmox_userspace)
----------------------------------------------------------------------
Traceback (most recent call last):
  File "/mnt/5_hdd/felhom.eu/wt/pb/felhom-agent/configs/test_felhom_os_apply.py", line 1466, in test_ring0_pending_pve_takes_only_installed_proxmox_userspace
    self.assertEqual(rc, 0, rep)
    ~~~~~~~~~~~~~~~~^^^^^^^^^^^^
AssertionError: 2 != 0 : {'mode': None, 'pass_seconds': 0.0, 'refused': {'code': 'R12', 'reason': "layer 'pve' is not guest, host or docker"}}

======================================================================
FAIL: test_shim_in_a_pve_plan_is_refused (configs.test_felhom_os_apply.PVELane.test_shim_in_a_pve_plan_is_refused)
----------------------------------------------------------------------
Traceback (most recent call last):
  File "/mnt/5_hdd/felhom.eu/wt/pb/felhom-agent/configs/test_felhom_os_apply.py", line 1383, in test_shim_in_a_pve_plan_is_refused
    self.refused(f, "R14")
    ~~~~~~~~~~~~^^^^^^^^^^
  File "/mnt/5_hdd/felhom.eu/wt/pb/felhom-agent/configs/test_felhom_os_apply.py", line 1357, in refused
    self.assertEqual(rep["refused"]["code"], code, rep)
    ~~~~~~~~~~~~~~~~^^^^^^^^^^^^^^^^^^^^^^^^^^^^^^^^^^^
AssertionError: 'R12' != 'R14'
- R12
?   ^
+ R14
?   ^
 : {'mode': None, 'pass_seconds': 0.0, 'refused': {'code': 'R12', 'reason': "layer 'pve' is not guest, host or docker"}}

======================================================================
FAIL: test_undo_is_refused (configs.test_felhom_os_apply.PVELane.test_undo_is_refused)
----------------------------------------------------------------------
Traceback (most recent call last):
  File "/mnt/5_hdd/felhom.eu/wt/pb/felhom-agent/configs/test_felhom_os_apply.py", line 1450, in test_undo_is_refused
    self.refused(f, "R5")
    ~~~~~~~~~~~~^^^^^^^^^
  File "/mnt/5_hdd/felhom.eu/wt/pb/felhom-agent/configs/test_felhom_os_apply.py", line 1357, in refused
    self.assertEqual(rep["refused"]["code"], code, rep)
    ~~~~~~~~~~~~~~~~^^^^^^^^^^^^^^^^^^^^^^^^^^^^^^^^^^^
AssertionError: 'R12' != 'R5'
- R12
+ R5
 : {'mode': None, 'pass_seconds': 0.0, 'refused': {'code': 'R12', 'reason': "layer 'pve' is not guest, host or docker"}}

======================================================================
FAIL: test_unlisted_new_package_is_refused (configs.test_felhom_os_apply.PVELane.test_unlisted_new_package_is_refused)
----------------------------------------------------------------------
Traceback (most recent call last):
  File "/mnt/5_hdd/felhom.eu/wt/pb/felhom-agent/configs/test_felhom_os_apply.py", line 1431, in test_unlisted_new_package_is_refused
    self.refused(f, "R6")
    ~~~~~~~~~~~~^^^^^^^^^
  File "/mnt/5_hdd/felhom.eu/wt/pb/felhom-agent/configs/test_felhom_os_apply.py", line 1357, in refused
    self.assertEqual(rep["refused"]["code"], code, rep)
    ~~~~~~~~~~~~~~~~^^^^^^^^^^^^^^^^^^^^^^^^^^^^^^^^^^^
AssertionError: 'R12' != 'R6'
- R12
+ R6
 : {'mode': None, 'pass_seconds': 0.0, 'refused': {'code': 'R12', 'reason': "layer 'pve' is not guest, host or docker"}}

----------------------------------------------------------------------
Ran 17 tests in 0.023s

FAILED (failures=14)
