test_password_special_carries_the_controllers_shape (test_check_volume_persistence.TestEnvBuilding.test_password_special_carries_the_controllers_shape)
R-735: `password:N:special` must be what the controller's randomWithSpecial mints (deploy.go L1335): ... FAIL

======================================================================
FAIL: test_password_special_carries_the_controllers_shape (test_check_volume_persistence.TestEnvBuilding.test_password_special_carries_the_controllers_shape)
R-735: `password:N:special` must be what the controller's randomWithSpecial mints (deploy.go L1335):
----------------------------------------------------------------------
Traceback (most recent call last):
  File "/mnt/5_hdd/felhom.eu/git/app-catalog-felhom.eu/scripts/test_check_volume_persistence.py", line 453, in test_password_special_carries_the_controllers_shape
    self.assertEqual(len(v), 24, v)
    ~~~~~~~~~~~~~~~~^^^^^^^^^^^^^^^
AssertionError: 32 != 24 : <the generated throwaway value, redacted>

----------------------------------------------------------------------
Ran 1 test in 0.002s

FAILED (failures=1)
