FAIL
FAIL: test_the_apps_own_folders_are_cleared_and_said (__main__.ClearScratch.test_the_apps_own_folders_are_cleared_and_said)
AssertionError: True is not false : the last run's files are still there
FAIL: test_every_request_errored_is_inconclusive (__main__.LoadVerdict.test_every_request_errored_is_inconclusive)
AssertionError: 'reached' != 'inconclusive'
FAIL: test_under_half_is_inconclusive_and_none_is_inconclusive (__main__.LoadVerdict.test_under_half_is_inconclusive_and_none_is_inconclusive)
AssertionError: 'reached' != 'inconclusive'
FAILED (failures=3)
OK
