F...
======================================================================
FAIL: test_decoy_body_mention_is_not_the_line (__main__.MinAgentHeaderGateTest.test_decoy_body_mention_is_not_the_line)
R-421: the word in prose, a code span, or a non-bold form is the LABEL without the FACT.
----------------------------------------------------------------------
Traceback (most recent call last):
  File "/mnt/5_hdd/felhom.eu/git/felhom-controller/controller/scripts/test_minagent_header_gate.py", line 49, in test_decoy_body_mention_is_not_the_line
    self.assertEqual(rc, 1, out)
    ~~~~~~~~~~~~~~~~^^^^^^^^^^^^
AssertionError: 0 != 1 : minagent header gate OK — v0.239.0 declares MinAgent 0.129.0


----------------------------------------------------------------------
Ran 4 tests in 0.124s

FAILED (failures=1)
mutated-rc=1
